{"text_format":"1","workbook":"xlsx","n_sheets":12,"sheets":["Home","Definition","Tools","Definitions","Tool to Use","Tool Summary","Data Types","Minitab","Level","Sample size","Formulas","old tool"],"not_rendered":{"charts":0,"images":30,"macros":1,"external_links":1,"defined_names":135,"comments":0,"pivot_tables":0},"unopened":[],"bounds":{"document_bytes":16777216,"sheet_cells":100000,"rows_first":2000,"rows_last":500,"rows_between":2000,"halvings":0,"cell_chars":16384,"cell_head_chars":4096},"cells_cut":0,"cells_raw":0,"read":"whole","date_system":"1900"}

{"sheet":"Home","index":0,"n_rows":1,"n_cols":3,"rows_kept":1,"cut":false,"hidden":false,"merged":[[0,2,0,8]]}
[null,null,"The Juran e-Lifeline Ready Reference"]

{"sheet":"Definition","index":1,"n_rows":7,"n_cols":5,"rows_kept":7,"cut":false,"hidden":false,"merged":[[6,4,6,8]]}
[]
[]
[]
[]
[null,"DEFINITIONS:"]
[]
[null,null,null,57,{"$f":"INDEX(Definitions!B4:B187,D7,1)","v":"A factor is an independent variable; an X."}]

{"sheet":"Tools","index":2,"n_rows":18,"n_cols":9,"rows_kept":18,"cut":false,"hidden":false,"merged":[[10,4,17,4],[10,6,17,6],[10,8,17,8]]}
[]
[null,null,null,{"$f":"IF(D4=0,0,D3+1)","v":0}]
[null,null,null,45]
[null,null,null,{"$f":"INDEX('Tool to Use'!G2:G103,$D3,1)","v":0}]
[]
[]
[]
[null,"TOOLS:"]
[]
[null,"Tools:",null,{"$f":"IF(D12=0,0,D11+1)","v":2},"What does it do?",null,"Why use it?",null,"When to use?"]
{"$rows_left_out":9}
{"sheet":"Definitions","index":3,"n_rows":188,"n_cols":3,"rows_kept":188,"cut":false,"hidden":false,"merged":[]}
["Definitions"]
[null,null,{"$f":"COUNTA(A4:A187)","v":184}]
["Term","Definition","Training Link"]
["1-Sample sign test","Tests the probability of sample median being equal to hypothesized value."]
["Accuracy","Accuracy refers to the variation between a measurement and what actually exists. It is the difference between an individual's average measurements and that of a known standard, or accepted \"truth.\""]
["Alpha risk","Alpha risk is defined as the risk of accepting the alternate hypothesis when, in fact, the null hypothesis is true; in other words, stating a difference exists where actually there is none. Alpha risk is stated in terms of probability (such as 0.05 or 5%). The acceptable level of alpha risk is determined by an organization or individual and is based on the nature of the decision being made. For decisions with high consequences (such as those involving risk to human life), an alpha risk of less than 1% would be expected. If the decision involves minimal time or money, an alpha risk of 10% may be appropriate. In general, an alpha risk of 5% is considered the norm in decision making. Sometimes alpha risk is expressed as its inverse, which is confidence level. In other words, an alpha risk of 5% also could be expressed as a 95% confidence level."]
["Alternative hypothesis (Ha)","The alternate hypothesis (Ha) is a statement that the observed difference or relationship between two populations is real and not due to chance or sampling error. The alternate hypothesis is the opposite of the null hypothesis  (P < 0.05).  A dependency exists between two or more factors"]
["Analysis of variance (ANOVA)","Analysis of variance is a statistical technique for analyzing data that tests for a difference between two or more means. See the tool 1-Way ANOVA."]
["Anderson-Darling Normality Test","P-value < 0.05 = not normal.  "]
["Attribute Data","see discrete data"]
{"$rows_left_out":179}
{"sheet":"Tool to Use","index":4,"n_rows":66,"n_cols":7,"rows_kept":66,"cut":false,"hidden":false,"merged":[]}
["Tool","What does it do?","Why use?","When use?","Data Type","P < .05 indicates","Picture"]
["1-Sample t-Test","Compares mean to target","The 1-sample t-test is useful in identifying a significant difference between a sample mean and a specified value when the difference is not readily apparent from graphical tools.  Using the 1-sample t-test to compare data gathered before process improvements and after is a way to prove that the mean has actually shifted.","The 1-sample t-test is used with continuous data any time you need to compare a sample mean to a specified value. This is useful when you need to make judgments about a process based on a sample output from that process.","Continuous X & Y","Not equal",1]
["1-Way ANOVA","ANOVA tests to see if the difference between the means of each level is significantly more than the variation within each level.  1-way ANOVA is used when two or more means (a single factor with three or more levels) must be compared with each other.\n","One-way ANOVA is useful for identifying a statistically significant difference between means of three or more levels of a factor.","Use 1-way ANOVA when you need to compare three or more means (a single factor with three or more levels) and determine how much of the total observed variation can be explained by the factor.","Continuous Y, Discrete Xs","At least one group of data is different than at least one other group.",0]
["2-Sample t-Test","A statistical test used to detect differences between means of two populations.  ","The 2-sample t-test is useful for identifying a significant difference between means of two levels (subgroups) of a factor. It is also extremely useful for identifying important Xs for a project Y. ","When you have two samples of continuous data, and you need to know if they both come from the same population or if they represent two different populations","Continuous X & Y","There is a difference in the means",0]
["ANOVA GLM","ANOVA General Linear Model (GLM) is a statistical tool used to test for differences in means.  ANOVA tests to see if the difference between the means of each level is significantly more than the variation within each level.   ANOVA GLM is used to test the effect of two or more factors with multiple levels, alone and in combination, on a dependent variable.","The General Linear Model allows you to learn one form of ANOVA that can be used for all tests of mean differences involving two or more factors or levels.  Because ANOVA GLM is useful for identifying the effect of two or more factors (independent variables) on a dependent variable, it is also extremely useful for identifying important Xs for a project Y.  ANOVA GLM also yields a percent contribution that quantifies the variation in the response (dependent variable) due to the individual factors and combinations of factors.","You can use ANOVA GLM any time you need to identify a statistically significant difference in the mean of the dependent variable due to two or more factors with multiple levels, alone and in combination.  ANOVA GLM also can be used to quantify the amount of variation in the response that can be attributed to a specific factor in a designed experiment.","Continuous Y & all X's","At least one group of data is different than at least one other group.",0]
["Benchmarking","Benchmarking is an improvement tool whereby a company:   Measures its performance or process against other companies' best in class practices,  Determines how those companies achieved their performance levels,  Uses the information to improve its own performance.","Benchmarking is an important tool in the improvement of your process for several reasons. First, it allows you to compare your relative position for this product or service against industry leaders or other companies outside your industry who perform similar functions. Second, it helps you identify potential Xs by comparing your process to the benchmarked process. Third, it may encourage innovative or direct applications of solutions from other businesses to your product or process. And finally, benchmarking can help to build acceptance for your project's results when they are compared to benchmark data obtained from industry leaders.","Benchmarking can be done at any point in the Six Sigma process when you need to develop a new process or improve an existing one","all","N/A",1]
["Best Subsets","Tells you the best X to use when you're comparing multiple X's in regression assessment.","Best Subsets is an efficient way to select a group of \"best subsets\" for further analysis by selecting the smallest subset that fulfills certain statistical criteria. The subset model may actually estimate the regression coefficients and predict future responses with smaller variance than the full model using all predictors","Typically used before or after a multiple-regression analysis.  Particularly useful in determining which X combination yields the best R-sq value.","Continuous X & Y","N/A",0]
["Binary Logistic Regression","Binary logistic regression is useful in two important applications: analyzing the differences among discrete Xs and modeling the relationship between a discrete binary Y and discrete and/or continuous Xs.","Binary logistic regression is useful in two applications: analyzing the differences among discrete Xs and modeling the relationship between a discrete binary Y and discrete and/or continuous Xs.   Binary logistic regression can be used to model the relationship between a discrete binary Y and discrete and/or continuous Xs. The predicted values will be probabilities p(d) of an event such as success or failure-not an event count. The predicted values will be bounded between zero and one (because they are probabilities).\n\n","Generally speaking, logistic regression is used when the Ys are discrete and the Xs are continuous","Defectives Y / Continuous & Discrete X","The goodness-of-fit tests, with p-values ranging from 0.312 to 0.724, indicate that there is insufficient evidence for the model not fitting the data adequately. If the p-value is less than your accepted a level, the test would indicate sufficient evidence for a conclusion of an inadequate fit.",0]
["Box Plot","A box plot is a basic graphing tool that displays the centering, spread, and distribution of a continuous data set. In simplified terms, it is made up of a box and whiskers (and occasional outliers) that correspond to each fourth, or quartile, of the data set. The box represents the second and third quartiles of data. The line that bisects the box is the median of the entire data set-50% of the data points fall below this line and 50% fall above it. The first and fourth quartiles are represented by \"whiskers,\" or lines that extend from both ends of the box.","a box plot can help you visualize the centering, spread, and distribution of your data quickly. It is especially useful to view more than one box plot simultaneously to compare the performance of several processes such as the price quote cycle between offices or the accuracy of component placement across several production lines. A box plot can help identify candidates for the causes behind your list of potential Xs. It also is useful in tracking process improvement by comparing successive plots generated over time","You can use a box plot throughout an improvement project, although it is most useful in the Analyze phase. In the Measure phase you can use a box plot to begin to understand the nature of a problem. In the Analyze phase a box plot can help you identify potential Xs that should be investigated further. It also can help eliminate potential Xs. In the Improve phase you can use a box plot to validate potential improvements","Continuous X & Y","N/A",1]
["Box-Cox Transformation","used to find the mathematical function needed to translate a continuous but nonnormal distribution into a normal distribution. After you have entered your data, Minitab tells you what mathematical function can be applied to each of your data points to bring your data closer to a normal distribution.","Many tools require that data be normally distributed to produce accurate results. If the data set is not normal, this may reduce significantly the confidence in the results obtained.","If your data is not normally distributed, you may encounter problems in Calculating Z values with continuous data. You could calculate an inaccurate representation of your process capability. In constructing control charts.... Your process may appear more or less in control than it really is. In Hypothesis testing... As your data becomes less normal, the results of your tests may not be valid. ","Continuous X & Y","N/A",1]
{"$rows_left_out":57}
{"sheet":"Tool Summary","index":5,"n_rows":22,"n_cols":6,"rows_kept":22,"cut":false,"hidden":true,"merged":[[2,4,2,5],[12,1,13,1],[3,3,3,4],[3,5,3,6],[4,2,12,2],[13,2,21,2]]}
[]
[null,null,"Tool Summary"]
[null,null,null,null,"Y's"]
[null,null,null,"Continuous Data",null,"Attribute Data"]
[null,null,"Continuous Data","Regression","Scatter plot","Logistic regression"]
[null,null,null,"Time series plots","Matrix Plot","Time series plot"]
[null,null,null,"General Linear model","Fitted line","C chart"]
[null,null,null,"Multi-Vari plot","Step wise Regression","P chart"]
[null,null,null,"Histogram",null,"N chart"]
[null,null,null,"DOE",null,"NP chart"]
{"$rows_left_out":13}
{"sheet":"Data Types","index":6,"n_rows":20,"n_cols":6,"rows_kept":20,"cut":false,"hidden":false,"merged":[[2,1,3,1],[4,3,4,5],[2,3,3,5],[2,2,3,2]]}
[]
[]
[null," ","Continuous","Discrete"]
[]
[null," ","aka quantitative data","aka qualitative/categorical/attribute data"]
[null,"Measurement","Units (example)","Ordinal (example)","Nominal (example)","Binary (example)"]
[null,"Time of day","Hours, minutes, seconds","1, 2, 3, etc.","N/A","a.m./p.m."]
[null,"Date","Month, date, year","Jan., Feb., Mar., etc.","N/A","Before/after"]
[null,"Cycle time","Hours, minutes, seconds, month, date, year","10, 20, 30, etc.","N/A","Before/after"]
[null,"Speed","Miles per hour/centimeters per second","10, 20, 30, etc.","N/A","Fast/slow"]
{"$rows_left_out":11}
{"sheet":"Minitab","index":7,"n_rows":19,"n_cols":8,"rows_kept":19,"cut":false,"hidden":true,"merged":[]}
["Tool","Use When","Example","Minitab Format","Data Format","Y","Xs","p < 0.05 indicates"]
["ANOVA","Determine if the average of a group of data is different than the average of other (multiple) groups of data","Compare multiple fixtures to determine if one or more performs differently","Stat                                        ANOVA                                        Oneway","Response data must be stacked in one column and the individual points must be tagged (numerically) in another column.","Variable","Attribute","At least one group of data is different than at least one other group."]
["Box & Whisker Plot","Compare median and variation between groups of data.  Also identifies outliers.","Compare turbine blade weights using different scales.","Graph                                      Boxplot","Response data must be stacked in one column and the individual points must be tagged (numerically) in another column.","Variable","Attribute","N/A"]
["Cause & Effect Diagram/      Fishbone","Brainstorming possible sources of variation for a particular effect","Potential sources of variation in gage r&r","Stat                                        Quality Tools                            Cause and Effect","Input ideas in proper column heading for main branches of fishbone.  Type effect in pulldown window.","All","All","N/A"]
["Chi-Square","Determine if one set of defectives data is different than other sets of defectives data.","Compare DPUs between GE90 and CF6","Stat                                        Tables                                       Chi-square Test","Input two columns; one column containing the number of non-defective, and the other containing the number of defective.","Discrete","Discrete","At least one group is statistically different."]
["Dot Plot","Quick graphical comparison of two or more processes' variation or spread","Compare length of service of GE90 technicians to CF6 technicians","Graph                                        Character Graphs                Dotplot","Input multiple columns of data of equal length","Variable","Attribute","N/A"]
["General Linear Models","Determine if difference in categorical data between groups is real when taking into account other variable x's ","Determine if height and weight are significant variables between two groups when looking at pay","Stat                                        ANOVA                                      General Linear Model","Response data must be stacked in one column and the individual points must be tagged (numerically) in another column.  Other variables must be stacked in separate columns.","Variable","Attribute/ Variable","At least one group of data is different than at least one other group."]
["Histogram","View the distribution of data (spread, mean, mode, outliers, etc.)","View the distribution of Y","Graph                                      Histogram                            or                              Stat                      Quality Tools                          Process Capability","Input one column of data","Variable","Attribute","N/A"]
["Homogeneity of Variance","Determine if the variation in one group of data is different than the variation in other (multiple) groups of data","Compare the variation between teams","Stat                                         ANOVA                       Homogeneity of Variance","Response data must be stacked in one column and the individual points must be tagged (numerically) in another column.","Variable","Attribute","(Use Levene's Test)  At least one group of data is different than at least one other group"]
["Kruskal-Wallis Test","Determine if the means of non-normal data are different","Compare the means of cycle time for different delivery methods","Stat                                        Nonparametrics                        Kruskal-Wallis","Response data must be stacked in one column and the individual points must be tagged (numerically) in another column.","Variable","Attribute","At least one mean is different"]
{"$rows_left_out":10}
{"sheet":"Level","index":8,"n_rows":34,"n_cols":11,"rows_kept":34,"cut":false,"hidden":false,"merged":[[9,2,9,6],[24,2,24,6],[15,2,16,3]]}
[]
[]
[]
[]
[]
[]
[]
[null,null,"SIGMA LEVEL:"]
[]
[null,null,"Sigma Level for continuous data",null,null,null,null,null,null,"White cells are user defined"]
{"$rows_left_out":25}
{"sheet":"Sample size","index":9,"n_rows":28,"n_cols":9,"rows_kept":28,"cut":false,"hidden":false,"merged":[]}
[]
[]
[]
[]
[]
[]
[]
[null,null,"SAMPLE SIZE:"]
[]
[]
{"$rows_left_out":19}
{"sheet":"Formulas","index":10,"n_rows":0,"n_cols":0,"rows_kept":0,"cut":false,"hidden":true,"merged":[]}

{"sheet":"old tool","index":11,"n_rows":63,"n_cols":5,"rows_kept":63,"cut":false,"hidden":true,"merged":[]}
["Tool","What does it do?","Why use?","When use?","Data Type"]
["1-Sample t-Test","Compares mean to target","The 1-sample t-test is useful in identifying a significant difference between a sample mean and a specified value when the difference is not readily apparent from graphical tools.  Using the 1-sample t-test to compare data gathered before process improvements and after is a way to prove that the mean has actually shifted.","The 1-sample t-test is used with continuous data any time you need to compare a sample mean to a specified value. This is useful when you need to make judgments about a process based on a sample output from that process.","cont (measurement)"]
["1-Way ANOVA","ANOVA tests to see if the difference between the means of each level is significantly more than the variation within each level.  1-way ANOVA is used when two or more means (a single factor with three or more levels) must be compared with each other.\n","One-way ANOVA is useful for identifying a statistically significant difference between means of three or more levels of a factor.","Use 1-way ANOVA when you need to compare three or more means (a single factor with three or more levels) and determine how much of the total observed variation can be explained by the factor.","Attribute X, Cont Y"]
["2-Sample t-Test","A statistical test used to detect differences between means of two populations.  ","The 2-sample t-test is useful for identifying a significant difference between means of two levels (subgroups) of a factor. It is also extremely useful for identifying important Xs for a project Y. ","When you have two samples of continuous data, and you need to know if they both come from the same population or if they represent two different populations","cont (measurement)"]
["ANOVA GLM","ANOVA General Linear Model (GLM) is a statistical tool used to test for differences in means.  ANOVA tests to see if the difference between the means of each level is significantly more than the variation within each level.   ANOVA GLM is used to test the effect of two or more factors with multiple levels, alone and in combination, on a dependent variable.","The General Linear Model allows you to learn one form of ANOVA that can be used for all tests of mean differences involving two or more factors or levels.  Because ANOVA GLM is useful for identifying the effect of two or more factors (independent variables) on a dependent variable, it is also extremely useful for identifying important Xs for a project Y.  ANOVA GLM also yields a percent contribution that quantifies the variation in the response (dependent variable) due to the individual factors and combinations of factors.","You can use ANOVA GLM any time you need to identify a statistically significant difference in the mean of the dependent variable due to two or more factors with multiple levels, alone and in combination.  ANOVA GLM also can be used to quantify the amount of variation in the response that can be attributed to a specific factor in a designed experiment.","cont (measurement)"]
["Benchmarking","Benchmarking is an improvement tool whereby a company:   Measures its performance or process against other companies' best in class practices,  Determines how those companies achieved their performance levels,  Uses the information to improve its own performance.","Benchmarking is an important tool in the improvement of your process for several reasons. First, it allows you to compare your relative position for this product or service against industry leaders or other companies outside your industry who perform similar functions. Second, it helps you identify potential Xs by comparing your process to the benchmarked process. Third, it may encourage innovative or direct applications of solutions from other businesses to your product or process. And finally, benchmarking can help to build acceptance for your project's results when they are compared to benchmark data obtained from industry leaders.","Benchmarking can be done at any point in the Six Sigma process when you need to develop a new process or improve an existing one"]
["Best Subsets","Tells you the best X to use when you're comparing multiple X's in regression assessment.",null,null,"cont (measurement)"]
["Binary Logistic Regression","Binary logistic regression is useful in two important applications: analyzing the differences among discrete Xs and modeling the relationship between a discrete binary Y and discrete and/or continuous Xs.",null,null,"Defectives Y / Continuous & Discrete X"]
["Box Plot"]
["Box-Cox Transformation","used to find the mathematical function needed to translate a continuous but nonnormal distribution into a normal distribution. After you have entered your data, Minitab tells you what mathematical function can be applied to each of your data points to bring your data closer to a normal distribution.",null,null,"Continuous X & Y"]
{"$rows_left_out":53}